{"text_format":"1","workbook":"xlsx","n_sheets":10,"sheets":["Title Page","Instructions","Agenda & Attendance","Drawings","1","Minutes Template","AS1.1","Action Sheet Template","Parking Lot","Guidewords"],"not_rendered":{"charts":0,"images":1,"macros":1,"external_links":1,"defined_names":70,"comments":0,"pivot_tables":0},"unopened":[],"bounds":{"document_bytes":16777216,"sheet_cells":100000,"rows_first":2000,"rows_last":500,"rows_between":2000,"halvings":0,"cell_chars":16384,"cell_head_chars":4096},"cells_cut":0,"cells_raw":0,"read":"whole","date_system":"1900"}

{"sheet":"Title Page","index":0,"n_rows":32,"n_cols":10,"rows_kept":32,"cut":false,"hidden":false,"merged":[[52,2,52,4],[53,2,53,4],[30,6,30,9],[45,2,45,4],[46,2,46,4],[47,2,47,4],[48,2,48,4],[49,2,49,4],[50,2,50,4],[34,2,34,4],[31,2,31,4],[32,2,32,4],[33,2,33,4],[43,2,43,4],[44,2,44,4],[41,2,41,4],[42,2,42,4],[51,2,51,4],[35,2,35,4],[36,2,36,4],[37,2,37,4],[38,2,38,4],[39,2,39,4],[40,2,40,4],[3,3,7,7],[24,2,24,3],[24,4,24,8],[26,2,26,3],[26,4,26,8],[16,2,16,3],[16,4,16,8],[14,2,14,3],[18,2,18,3],[20,2,20,3],[22,2,22,3],[14,4,14,8],[18,4,18,8],[20,4,20,8],[22,4,22,8]]}
[]
[]
[]
[null,null,null,{"$f":"E17","v":"INSERT PROJECT TITLE"}]
[]
[]
[]
[]
[]
[null,null,null,null,null,"HAZID STUDY REPORT"]
[]
[]
[]
[]
[null,null,"Project Number",null,"INSERT PROJECT NUMBER"]
[]
[null,null,"Project Title",null,"INSERT PROJECT TITLE"]
[]
[null,null,"Client Name",null,"INSERT CLIENT NAME"]
[]
[null,null,"HAZID Date(s)",null,"INSERT HAZID DATE(S)"]
[]
[null,null,"Project Scope and Objectives",null,"BRIEF OUTLINE OF PROJECT SCOPE AND HAZID OBJECTIVES"]
[]
[null,null,"HAZID Facilitator",null,"INSERT HAZID FACILITATOR NAME"]
[]
[null,null,"HAZID Scribe",null,"INSERT HAZID SCRIBE NAME"]
[]
[]
[null,"DOCUMENT CONTROL"]
{"$rows_left_out":3}
{"sheet":"Instructions","index":1,"n_rows":54,"n_cols":5,"rows_kept":54,"cut":false,"hidden":false,"merged":[[53,1,53,10],[19,2,19,10],[20,2,20,10],[49,2,49,3],[49,4,49,9],[50,2,50,3],[50,4,50,9],[51,2,51,3],[51,4,51,9],[44,2,44,3],[44,4,44,9],[46,1,46,10],[32,2,32,10],[48,2,48,3],[48,4,48,9],[41,2,41,3],[41,4,41,9],[42,2,42,3],[42,4,42,9],[43,2,43,3],[43,4,43,9],[29,2,29,10],[30,2,30,10],[34,1,34,10],[38,1,38,10],[40,2,40,3],[40,4,40,9],[31,2,31,10],[1,3,2,9],[25,2,25,10],[26,2,26,10],[27,2,27,10],[28,2,28,10],[24,1,24,10],[11,2,11,5],[7,1,7,10],[10,1,10,10],[12,1,12,10],[17,2,17,10],[18,2,18,10]]}
[]
[null,null,null,"File Usage Instructions"]
[]
[]
["1.0","Introduction - Safety in Design Requirements"]
[]
[null,"Purpose:"]
[null,"Support the design activity by the identification of significant hazards associated with the design for a project and to develop adequate safeguards to control any imposed risks.  Furthermore, the HAZID must consider early constructability and commissioning so design can allow for these phases to be efficiently completed and de-risk the project."]
[]
[null,"Timing:"]
[null,"Contractor must undertake the HAZID during the concept design Gate – generally done at 30% design progress, usually during the project milestone 2 Gate. The Project Documentation will define milestone when HAZID must be done."]
[]
[null,"Note: Unless stated otherwise, the Consultant/Contractor is required to comply with the requirements set out in Pr8187 - Safety in Design Procedure."]
[]
[1.1000000000000001,"Required Documentation"]
[]
[null,"The following list outlines the documentation typically required for HAZID workshops:"]
[null,null,"•         Equipment GAs "]
[null,null,"•         Site Layouts and Elevations"]
[null,null,"•         3D Model, where applicable"]
[null,null,"•         Electronic HAZID Template"]
[]
[1.2,"Required Attendees"]
[]
[null,"In accordance with document Pr8187 Appendix B, the team composition for the workshop must be agreed with the Project Manager and should be reflected in the Attendance sheet provided. It normally, as a minimum, must include:"]
[null,null,"•         Independent Facilitator supported by a Scribe"]
[null,null,"•         Project Manager(s) - UW and Contractor"]
[null,null,"•         Designers (e.g. process, electrical, mechanical, civil/structural engineers)"]
[null,null,"•         Independent technical specialist, as required"]
[null,null,"•         UW Operations representative"]
{"$rows_left_out":25}
{"sheet":"Agenda & Attendance","index":2,"n_rows":29,"n_cols":10,"rows_kept":29,"cut":false,"hidden":false,"merged":[[36,3,36,4],[37,3,37,4],[38,3,38,4],[4,2,4,10],[8,2,8,10],[7,2,7,10],[6,2,6,10],[5,2,5,10],[35,1,35,2],[30,3,30,4],[31,3,31,4],[32,3,32,4],[33,3,33,4],[34,3,34,4],[28,7,28,8],[29,7,29,8],[28,5,28,6],[38,5,38,6],[39,5,39,6],[40,3,40,4],[41,3,41,4],[30,5,30,6],[31,5,31,6],[32,5,32,6],[33,5,33,6],[34,5,34,6],[35,5,35,6],[36,5,36,6],[37,5,37,6],[40,5,40,6],[41,5,41,6],[35,3,35,4],[43,1,43,2],[44,1,44,2],[30,1,30,2],[31,1,31,2],[32,1,32,2],[33,1,33,2],[34,1,34,2],[41,1,41,2],[39,1,39,2],[40,1,40,2],[36,1,36,2],[37,1,37,2],[38,1,38,2],[1,3,2,7],[4,0,4,1],[44,3,44,4],[43,5,43,6],[44,5,44,6],[26,1,26,10],[29,5,29,6],[42,5,42,6],[28,3,28,4],[29,3,29,4],[42,3,42,4],[43,3,43,4],[39,3,39,4],[28,1,28,2],[29,1,29,2],[42,1,42,2],[3,3,3,9],[44,7,44,8],[30,7,30,8],[43,7,43,8],[42,7,42,8],[41,7,41,8],[40,7,40,8],[39,7,39,8],[38,7,38,8],[37,7,37,8],[36,7,36,8],[35,7,35,8],[34,7,34,8],[33,7,33,8],[32,7,32,8],[31,7,31,8]]}
[]
[]
[]
[null,null,null,"AGENDA & ATTENDANCE"]
["Date",null,{"$f":"DATE","v":"INSERT HAZID DATE(S)"}]
["Head Contractor Name"]
["UW Project No. & Name",null,{"$f":"PROJNUM&\" \"&PROJTITLE","v":"INSERT PROJECT NUMBER INSERT PROJECT TITLE"}]
["Location (Site)"]
["Meeting Number"]
[]
[]
["2.0","Proposed Agenda"]
[]
[null,2.1,"Safety Share"]
[null,2.2000000000000002,"Introductions and Welcome (check of attendance in accordance with Pr8187 - Appendix B)"]
[null,2.2999999999999998,"Overview of the design intent and 3D model where applicable"]
[null,2.4,"Review previous actions"]
[null,2.5,"Custom breakdown structure for workshop discussion"]
[null,null,"2.5.1","Application of HAZID guidewords"]
[null,null,"2.5.2","Capture significant outcomes"]
[null,2.6,"Other issues"]
[null,2.7,"Workshop closure"]
[]
[]
["3.0","Attendance"]
[]
[null,"The following table provides a list of people attending the workshop and is to be signed by every attendee."]
[]
[null,"Name",null,"Company",null,"Position",null,"Contact",null,"Signature"]

{"sheet":"Drawings","index":3,"n_rows":31,"n_cols":9,"rows_kept":31,"cut":false,"hidden":false,"merged":[[20,8,20,9],[19,8,19,9],[18,8,18,9],[17,8,17,9],[16,8,16,9],[25,8,25,9],[24,8,24,9],[23,8,23,9],[22,8,22,9],[21,8,21,9],[30,8,30,9],[29,8,29,9],[28,8,28,9],[27,8,27,9],[26,8,26,9],[14,1,14,2],[15,1,15,2],[14,3,14,5],[15,3,15,5],[7,2,7,10],[12,1,12,10],[14,8,14,9],[14,6,14,7],[1,3,2,7],[4,0,4,1],[4,2,4,10],[5,2,5,10],[6,2,6,10],[16,1,16,2],[17,1,17,2],[15,8,15,9],[17,6,17,7],[16,6,16,7],[15,6,15,7],[17,3,17,5],[16,3,16,5],[18,1,18,2],[19,1,19,2],[20,1,20,2],[20,6,20,7],[19,6,19,7],[18,6,18,7],[20,3,20,5],[19,3,19,5],[18,3,18,5],[21,1,21,2],[22,1,22,2],[23,1,23,2],[23,6,23,7],[22,6,22,7],[21,6,21,7],[23,3,23,5],[22,3,22,5],[21,3,21,5],[24,1,24,2],[25,1,25,2],[26,1,26,2],[26,6,26,7],[25,6,25,7],[24,6,24,7],[26,3,26,5],[25,3,25,5],[24,3,24,5],[30,1,30,2],[27,1,27,2],[28,1,28,2],[29,1,29,2],[30,6,30,7],[29,6,29,7],[28,6,28,7],[27,6,27,7],[30,3,30,5],[29,3,29,5],[28,3,28,5],[27,3,27,5]]}
[]
[null,null,null,"DRAWINGS"]
[]
[]
["Date",null,{"$f":"DATE","v":"INSERT HAZID DATE(S)"}]
["Head Contractor Name",null,{"$f":"IF(HEADCONTRACTOR=\"\",\"\",HEADCONTRACTOR)","v":""}]
["UW Project No. & Name",null,{"$f":"PROJNUM&\" \"&PROJTITLE","v":"INSERT PROJECT NUMBER INSERT PROJECT TITLE"}]
["Location (Site)",null,{"$f":"IF(LOCATION=\"\",\"\",LOCATION)","v":""}]
[]
[]
["4.0","List of Drawings"]
[]
[null,"The following table provides a list of drawings used during the workshop and their associated revision numbers. This table should be filled out prior to the workshop and be printed along with the guideword set. At the start of the workshop it should be distributed to each attendee for reference to the relevant P&IDs."]
[]
[null,"No.",null,"P&ID/Document Ref No.",null,null,"Revision No.",null,"Minutes Sheet Ref."]
[null,1]
[null,2]
[null,3]
[null,4]
[null,5]
[null,6]
[null,7]
[null,8]
[null,9]
[null,10]
[null,11]
[null,12]
[null,13]
[null,14]
[null,15]
{"$rows_left_out":2}
{"sheet":"1","index":4,"n_rows":27,"n_cols":10,"rows_kept":27,"cut":false,"hidden":false,"merged":[[4,0,4,1],[4,4,4,5],[4,7,4,9]]}
["HAZID Minutes Recording Template"]
[]
[]
[]
["NODE:",null,1,"DESCRIPTION:",null,null,"P&ID/Doc Ref No.:"]
[]
["Ref No.","Category","Deviation-Guideword","Hazard","Cause(s)","Consequence(s)","Existing Safeguard(s)","Risk Owner","Response or Action Sheet Reference No.","Date Closed"]
[1]
[{"$f":"A8+1","v":2}]
[{"$f":"A9+1","v":3}]
[4]
[5]
[6]
[7]
[8,"Amenities and Facilities"]
[9]
[10]
[11]
[12]
[13]
[14]
[15]
[16]
[17]
[18]
[19]
[{"$f":"A26+1","v":20}]

{"sheet":"Minutes Template","index":5,"n_rows":27,"n_cols":10,"rows_kept":27,"cut":false,"hidden":false,"merged":[[4,4,4,5],[4,7,4,9],[4,0,4,1]]}
["HAZID Minutes Recording Template"]
[]
[]
[]
["NODE:",null,null,"DESCRIPTION:",null,null,"P&ID/Doc Ref No.:"]
[]
["Ref No.","Category","Deviation-Guideword","Hazard","Cause(s)","Consequence(s)","Existing Safeguard(s)","Risk Owner","Response or Action Sheet Reference No.","Date Closed"]
[1]
[{"$f":"A8+1","v":2}]
[{"$f":"A9+1","v":3}]
[4]
[5]
[6]
[7]
[8]
[9]
[10]
[11]
[12]
[13]
[14]
[15]
[16]
[17]
[18]
[19]
[{"$f":"A26+1","v":20}]

{"sheet":"AS1.1","index":6,"n_rows":91,"n_cols":14,"rows_kept":91,"cut":false,"hidden":false,"merged":[[17,3,17,4],[1,3,4,7],[6,0,6,1],[6,2,6,10],[7,2,7,10],[8,2,8,10],[9,2,9,10],[11,0,11,1],[11,2,11,10],[13,1,13,10],[15,3,15,4],[15,5,15,10],[27,1,27,2],[27,3,27,10],[19,1,19,10],[21,1,21,2],[21,3,21,10],[22,1,22,2],[22,3,22,10],[23,1,23,2],[23,3,23,10],[24,1,24,2],[24,3,24,10],[25,1,25,2],[25,3,25,10],[26,3,26,10],[38,0,38,1],[38,2,38,4],[38,5,38,7],[38,8,38,10],[28,1,28,2],[28,3,28,10],[30,1,30,10],[32,1,32,2],[32,3,32,10],[33,1,33,2],[33,3,33,10],[34,1,34,2],[34,3,34,10],[35,1,35,2],[35,3,35,10],[37,1,37,10],[39,0,39,1],[39,2,39,4],[39,5,39,7],[39,8,39,10],[40,0,40,1],[40,2,40,4],[40,5,40,7],[40,8,40,10],[43,0,43,1],[43,2,43,4],[43,5,43,7],[43,8,43,10],[41,0,41,1],[41,2,41,4],[41,5,41,7],[41,8,41,10],[42,0,42,1],[42,2,42,4],[42,5,42,7],[42,8,42,10]]}
[null,null,null,null,null,null,null,null,null,null,null,null,"Node Numbers","Item Reference Numbers"]
[null,null,null,"HAZID ACTION SHEET",null,null,null,null,null,null,null,null,1,1]
[null,null,null,null,null,null,null,null,null,null,null,null,{"$f":"M2+1","v":2},{"$f":"N2+1","v":2}]
[null,null,null,null,null,null,null,null,null,null,null,null,{"$f":"M3+1","v":3},3]
[null,null,null,null,null,null,null,null,null,null,null,null,4,4]
[null,null,null,null,null,null,null,null,null,null,null,null,5,5]
["HAZID Date(s)",null,{"$f":"DATE","v":"INSERT HAZID DATE(S)"},null,null,null,null,null,null,null,null,null,6,6]
["Head Contractor Name",null,{"$f":"IF(HEADCONTRACTOR=\"\",\"\",HEADCONTRACTOR)","v":""},null,null,null,null,null,null,null,null,null,7,7]
["UW Project No. & Name",null,{"$f":"PROJNUM&\" \"&PROJTITLE","v":"INSERT PROJECT NUMBER INSERT PROJECT TITLE"},null,null,null,null,null,null,null,null,null,8,8]
["Location (Site)",null,{"$f":"IF(LOCATION=\"\",\"\",LOCATION)","v":""},null,null,null,null,null,null,null,null,null,9,9]
[null,null,null,null,null,null,null,null,null,null,null,null,10,10]
["Action Sheet Due Date",null,null,null,null,null,null,null,null,null,null,null,11,11]
[null,null,null,null,null,null,null,null,null,null,null,null,12,12]
["P&ID Refs.",{"$f":"IF(VLOOKUP(NODE, INDIRECT(\"'\"&NODE&\"'!\"&\"NODE_DETAILS\"),6,0) = \"\",\"\", VLOOKUP(NODE,INDIRECT(\"'\"&NODE&\"'!\"&\"NODE_DETAILS\"),6,0))","v":""},null,null,null,null,null,null,null,null,null,null,{"$f":"M13+1","v":13},{"$f":"N13+1","v":13}]
[null,null,null,null,null,null,null,null,null,null,null,null,{"$f":"N14+1","v":14},{"$f":"N14+1","v":14}]
["NODE:",1,null,"NODE DESCRIPTION:",null,{"$f":"IF(VLOOKUP(NODE, INDIRECT(\"'\"&NODE&\"'!\"&\"NODE_DETAILS\"),3,0) = \"\",\"\", VLOOKUP(NODE,INDIRECT(\"'\"&NODE&\"'!\"&\"NODE_DETAILS\"),3,0))","v":""},null,null,null,null,null,null,15,15]
[null,null,null,null,null,null,null,null,null,null,null,null,16,16]
["Item Ref No.",1,null,"Sheet Ref No.",null,{"$f":"CONCATENATE(\"AS\",NODE,\".\",REF_NO)","v":"AS1.1"},null,null,null,null,null,null,17,17]
[null,null,null,null,null,null,null,null,null,null,null,null,18,18]
["1.0","Hazard Description",null,null,null,null,null,null,null,null,null,null,{"$f":"M19+1","v":19},19]
[null,null,null,null,null,null,null,null,null,null,null,null,20,20]
["No.","ITEM",null,"DETAILS",null,null,null,null,null,null,null,null,21,21]
[1.1000000000000001,"Category",null,{"$f":"IF(VLOOKUP(REF_NO,INDIRECT(\"'\"&NODE&\"'!\"&\"Minutes_Sheet\"),2,0)=\"\",\"\",VLOOKUP(REF_NO,INDIRECT(\"'\"&NODE&\"'!\"&\"Minutes_Sheet\"),2,0))","v":""},null,null,null,null,null,null,null,null,22,22]
[1.2,"Deviation/Guideword",null,{"$f":"IF(VLOOKUP(REF_NO,INDIRECT(\"'\"&NODE&\"'!\"&\"Minutes_Sheet\"),3,0)=\"\",\"\",VLOOKUP(REF_NO,INDIRECT(\"'\"&NODE&\"'!\"&\"Minutes_Sheet\"),3,0))","v":""},null,null,null,null,null,null,null,null,23,23]
[1.3,"Hazard",null,{"$f":"IF(VLOOKUP(REF_NO,INDIRECT(\"'\"&NODE&\"'!\"&\"Minutes_Sheet\"),4,0)=\"\",\"\",VLOOKUP(REF_NO,INDIRECT(\"'\"&NODE&\"'!\"&\"Minutes_Sheet\"),4,0))","v":""},null,null,null,null,null,null,null,null,24,24]
[1.4,"Cause(s)",null,{"$f":"IF(VLOOKUP(REF_NO,INDIRECT(\"'\"&NODE&\"'!\"&\"Minutes_Sheet\"),5,0)=\"\",\"\",VLOOKUP(REF_NO,INDIRECT(\"'\"&NODE&\"'!\"&\"Minutes_Sheet\"),5,0))","v":""},null,null,null,null,null,null,null,null,25,25]
[1.5,"Consequence(s)",null,{"$f":"IF(VLOOKUP(REF_NO,INDIRECT(\"'\"&NODE&\"'!\"&\"Minutes_Sheet\"),6,0)=\"\",\"\",VLOOKUP(REF_NO,INDIRECT(\"'\"&NODE&\"'!\"&\"Minutes_Sheet\"),6,0))","v":""},null,null,null,null,null,null,null,null,26,26]
[1.6,"Existing Safeguard(s)",null,{"$f":"IF(VLOOKUP(REF_NO,INDIRECT(\"'\"&NODE&\"'!\"&\"Minutes_Sheet\"),7,0)=\"\",\"\",VLOOKUP(REF_NO,INDIRECT(\"'\"&NODE&\"'!\"&\"Minutes_Sheet\"),7,0))","v":""},null,null,null,null,null,null,null,null,27,27]
[1.7,"Risk Owner",null,{"$f":"IF(VLOOKUP(REF_NO,INDIRECT(\"'\"&NODE&\"'!\"&\"Minutes_Sheet\"),8,0)=\"\",\"\",VLOOKUP(REF_NO,INDIRECT(\"'\"&NODE&\"'!\"&\"Minutes_Sheet\"),8,0))","v":""},null,null,null,null,null,null,null,null,28,28]
[null,null,null,null,null,null,null,null,null,null,null,null,29,29]
{"$rows_left_out":62}
{"sheet":"Action Sheet Template","index":7,"n_rows":91,"n_cols":14,"rows_kept":91,"cut":false,"hidden":false,"merged":[[43,2,43,4],[43,5,43,7],[43,8,43,10],[38,2,38,4],[41,8,41,10],[42,2,42,4],[42,5,42,7],[42,8,42,10],[40,0,40,1],[41,0,41,1],[42,0,42,1],[43,0,43,1],[37,1,37,10],[40,2,40,4],[41,2,41,4],[40,5,40,7],[40,8,40,10],[41,5,41,7],[38,5,38,7],[38,8,38,10],[38,0,38,1],[39,2,39,4],[39,5,39,7],[39,8,39,10],[35,1,35,2],[35,3,35,10],[39,0,39,1],[23,3,23,10],[24,3,24,10],[25,3,25,10],[26,3,26,10],[34,1,34,2],[34,3,34,10],[32,1,32,2],[33,1,33,2],[32,3,32,10],[33,3,33,10],[30,1,30,10],[23,1,23,2],[24,1,24,2],[1,3,4,7],[11,0,11,1],[11,2,11,10],[21,1,21,2],[21,3,21,10],[13,1,13,10],[15,3,15,4],[15,5,15,10],[19,1,19,10],[17,3,17,4],[22,1,22,2],[22,3,22,10],[6,0,6,1],[6,2,6,10],[7,2,7,10],[8,2,8,10],[9,2,9,10],[27,1,27,2],[27,3,27,10],[28,1,28,2],[28,3,28,10],[25,1,25,2]]}
[null,null,null,null,null,null,null,null,null,null,null,null,"Node Numbers","Item Reference Numbers"]
[null,null,null,"HAZID ACTION SHEET",null,null,null,null,null,null,null,null,1,1]
[null,null,null,null,null,null,null,null,null,null,null,null,{"$f":"M2+1","v":2},{"$f":"N2+1","v":2}]
[null,null,null,null,null,null,null,null,null,null,null,null,{"$f":"M3+1","v":3},{"$f":"N3+1","v":3}]
[null,null,null,null,null,null,null,null,null,null,null,null,4,4]
[null,null,null,null,null,null,null,null,null,null,null,null,5,5]
["HAZID Date(s)",null,{"$f":"DATE","v":"INSERT HAZID DATE(S)"},null,null,null,null,null,null,null,null,null,6,6]
["Head Contractor Name",null,{"$f":"IF(HEADCONTRACTOR=\"\",\"\",HEADCONTRACTOR)","v":""},null,null,null,null,null,null,null,null,null,7,7]
["UW Project No. & Name",null,{"$f":"PROJNUM&\" \"&PROJTITLE","v":"INSERT PROJECT NUMBER INSERT PROJECT TITLE"},null,null,null,null,null,null,null,null,null,8,8]
["Location (Site)",null,{"$f":"IF(LOCATION=\"\",\"\",LOCATION)","v":""},null,null,null,null,null,null,null,null,null,9,9]
[null,null,null,null,null,null,null,null,null,null,null,null,10,10]
["Action Sheet Due Date",null,null,null,null,null,null,null,null,null,null,null,11,11]
[null,null,null,null,null,null,null,null,null,null,null,null,12,12]
["P&ID Refs.",{"$f":"IF(VLOOKUP(NODE, INDIRECT(\"'\"&NODE&\"'!\"&\"NODE_DETAILS\"),6,0) = \"\",\"\", VLOOKUP(NODE,INDIRECT(\"'\"&NODE&\"'!\"&\"NODE_DETAILS\"),6,0))","v":{"$error":"#REF!"}},null,null,null,null,null,null,null,null,null,null,{"$f":"M13+1","v":13},{"$f":"N13+1","v":13}]
[null,null,null,null,null,null,null,null,null,null,null,null,{"$f":"N14+1","v":14},{"$f":"N14+1","v":14}]
["NODE:",null,null,"NODE DESCRIPTION:",null,{"$f":"IF(VLOOKUP(NODE, INDIRECT(\"'\"&NODE&\"'!\"&\"NODE_DETAILS\"),3,0) = \"\",\"\", VLOOKUP(NODE,INDIRECT(\"'\"&NODE&\"'!\"&\"NODE_DETAILS\"),3,0))","v":{"$error":"#REF!"}},null,null,null,null,null,null,15,15]
[null,null,null,null,null,null,null,null,null,null,null,null,16,16]
["Item Ref No.",null,null,"Sheet Ref No.",null,{"$f":"CONCATENATE(\"AS\",NODE,\".\",REF_NO)","v":"AS."},null,null,null,null,null,null,17,17]
[null,null,null,null,null,null,null,null,null,null,null,null,18,18]
["1.0","Hazard Description",null,null,null,null,null,null,null,null,null,null,19,19]
[null,null,null,null,null,null,null,null,null,null,null,null,20,20]
["No.","ITEM",null,"DETAILS",null,null,null,null,null,null,null,null,21,21]
[1.1000000000000001,"Category",null,{"$f":"IF(VLOOKUP(REF_NO,INDIRECT(\"'\"&NODE&\"'!\"&\"Minutes_Sheet\"),2,0)=\"\",\"\",VLOOKUP(REF_NO,INDIRECT(\"'\"&NODE&\"'!\"&\"Minutes_Sheet\"),2,0))","v":{"$error":"#REF!"}},null,null,null,null,null,null,null,null,22,22]
[1.2,"Deviation/Guideword",null,{"$f":"IF(VLOOKUP(REF_NO,INDIRECT(\"'\"&NODE&\"'!\"&\"Minutes_Sheet\"),3,0)=\"\",\"\",VLOOKUP(REF_NO,INDIRECT(\"'\"&NODE&\"'!\"&\"Minutes_Sheet\"),3,0))","v":{"$error":"#REF!"}},null,null,null,null,null,null,null,null,23,23]
[1.3,"Hazard",null,{"$f":"IF(VLOOKUP(REF_NO,INDIRECT(\"'\"&NODE&\"'!\"&\"Minutes_Sheet\"),4,0)=\"\",\"\",VLOOKUP(REF_NO,INDIRECT(\"'\"&NODE&\"'!\"&\"Minutes_Sheet\"),4,0))","v":{"$error":"#REF!"}},null,null,null,null,null,null,null,null,24,24]
[1.4,"Cause(s)",null,{"$f":"IF(VLOOKUP(REF_NO,INDIRECT(\"'\"&NODE&\"'!\"&\"Minutes_Sheet\"),5,0)=\"\",\"\",VLOOKUP(REF_NO,INDIRECT(\"'\"&NODE&\"'!\"&\"Minutes_Sheet\"),5,0))","v":{"$error":"#REF!"}},null,null,null,null,null,null,null,null,25,25]
[1.5,"Consequence(s)",null,{"$f":"IF(VLOOKUP(REF_NO,INDIRECT(\"'\"&NODE&\"'!\"&\"Minutes_Sheet\"),6,0)=\"\",\"\",VLOOKUP(REF_NO,INDIRECT(\"'\"&NODE&\"'!\"&\"Minutes_Sheet\"),6,0))","v":{"$error":"#REF!"}},null,null,null,null,null,null,null,null,26,26]
[1.6,"Existing Safeguard(s)",null,{"$f":"IF(VLOOKUP(REF_NO,INDIRECT(\"'\"&NODE&\"'!\"&\"Minutes_Sheet\"),7,0)=\"\",\"\",VLOOKUP(REF_NO,INDIRECT(\"'\"&NODE&\"'!\"&\"Minutes_Sheet\"),7,0))","v":{"$error":"#REF!"}},null,null,null,null,null,null,null,null,27,27]
[1.7,"Risk Owner",null,{"$f":"IF(VLOOKUP(REF_NO,INDIRECT(\"'\"&NODE&\"'!\"&\"Minutes_Sheet\"),8,0)=\"\",\"\",VLOOKUP(REF_NO,INDIRECT(\"'\"&NODE&\"'!\"&\"Minutes_Sheet\"),8,0))","v":{"$error":"#REF!"}},null,null,null,null,null,null,null,null,28,28]
[null,null,null,null,null,null,null,null,null,null,null,null,29,29]
{"$rows_left_out":62}
{"sheet":"Parking Lot","index":8,"n_rows":31,"n_cols":11,"rows_kept":31,"cut":false,"hidden":false,"merged":[[26,10,26,11],[27,10,27,11],[28,10,28,11],[29,10,29,11],[30,10,30,11],[30,1,30,2],[30,3,30,5],[30,6,30,7],[30,8,30,9],[29,1,29,2],[29,3,29,5],[29,6,29,7],[29,8,29,9],[15,10,15,11],[16,10,16,11],[17,10,17,11],[18,10,18,11],[25,10,25,11],[20,10,20,11],[21,10,21,11],[22,10,22,11],[23,10,23,11],[24,10,24,11],[19,10,19,11],[28,1,28,2],[28,3,28,5],[28,6,28,7],[28,8,28,9],[26,1,26,2],[26,3,26,5],[26,6,26,7],[26,8,26,9],[27,1,27,2],[27,3,27,5],[27,6,27,7],[27,8,27,9],[24,1,24,2],[24,3,24,5],[24,6,24,7],[24,8,24,9],[25,1,25,2],[25,3,25,5],[25,6,25,7],[25,8,25,9],[22,1,22,2],[22,3,22,5],[22,6,22,7],[22,8,22,9],[23,1,23,2],[23,3,23,5],[23,6,23,7],[23,8,23,9],[20,1,20,2],[20,3,20,5],[20,6,20,7],[20,8,20,9],[21,1,21,2],[21,3,21,5],[21,6,21,7],[21,8,21,9],[18,1,18,2],[18,3,18,5],[18,6,18,7],[18,8,18,9],[19,1,19,2],[19,3,19,5],[19,6,19,7],[19,8,19,9],[16,1,16,2],[16,3,16,5],[16,6,16,7],[16,8,16,9],[17,1,17,2],[17,3,17,5],[17,6,17,7],[17,8,17,9],[1,3,2,8],[15,1,15,2],[15,3,15,5],[15,6,15,7],[15,8,15,9],[4,0,4,1],[4,2,4,11],[5,2,5,11],[6,2,6,11],[7,2,7,11],[12,1,12,11],[14,1,14,2],[14,3,14,5],[14,6,14,7],[14,8,14,9],[14,10,14,11]]}
[]
[null,null,null,"PARKING LOT"]
[]
[]
["Date",null,{"$f":"DATE","v":"INSERT HAZID DATE(S)"}]
["Head Contractor Name",null,{"$f":"IF(HEADCONTRACTOR=\"\",\"\",HEADCONTRACTOR)","v":""}]
["UW Project No. & Name",null,{"$f":"PROJNUM&\" \"&PROJTITLE","v":"INSERT PROJECT NUMBER INSERT PROJECT TITLE"}]
["Location (Site)",null,{"$f":"IF(LOCATION=\"\",\"\",LOCATION)","v":""}]
[]
[]
[5,"Parking Lot Issues"]
[]
[null,"The following table provides a list of drawings used during the workshop and their associated revision numbers. This table should be filled out prior to the workshop and be printed along with the guideword set. At the start of the workshop it should be distributed to each attendee for reference to the relevant P&IDs."]
[]
[null,"No.",null,"Issue",null,null,"Document Ref.",null,"Referred to",null,"Minutes Sheet Ref."]
[null,1]
[null,2]
[null,3]
[null,4]
[null,5]
[null,6]
[null,7]
[null,8]
[null,9]
[null,10]
[null,11]
[null,12]
[null,13]
[null,14]
[null,15]
{"$rows_left_out":2}
{"sheet":"Guidewords","index":9,"n_rows":92,"n_cols":4,"rows_kept":92,"cut":false,"hidden":false,"merged":[[1,1,3,3],[25,1,31,1],[32,1,37,1],[7,1,8,1],[9,1,11,1],[12,1,14,1],[15,1,24,1],[38,1,39,1],[40,1,45,1],[46,1,49,1],[50,1,51,1],[52,1,58,1],[59,1,65,1],[66,1,73,1],[74,1,76,1],[77,1,80,1],[81,1,91,1]]}
[]
[null,"HAZID GUIDEWORDS"]
[]
[]
[]
[]
["Category","Guideword","Sub-prompts","Description (where relevant)"]
["Amenities and Facilities","Amenities and Facilities","Access","Access to various amenities and facilities such as storage, first aid rooms, sick rooms, rest rooms, meal and accommodation areas and drinking water."]
["Constructability"]
["Earthworks","Constructability"]
["Electrical Safety"]
["Falls Prevention"]
["Fire and Emergency","Earthworks","Excavations","Risks from earth collapsing or engulfment"]
["Maintenance Tasks",null,"Location","Location of underground services"]
["Manual Tasks",null,"Working adjacent to buried services and pressurised assets"]
["Materials Movement","Electrical Safety","Earthing of electrical installations"]
["Noise Exposure",null,"Protection of persons","Step and touch voltage limits"]
["People Movement",null,"Location of underground and overhead power cables"]
["Plant",null,"Protection of leads/cables"]
["Specific Risks",null,"Number and location of power points","Including Residual Control Devices for protection"]
["Structural Safety",null,"Arc flash hazard"]
["Substances",null,"Access","Access required to energised live equipment"]
["Working Environment",null,"Isolation and emergency stops"]
[null,null,"Isolation procedures"]
[null,null,"Pedestrian access to HV equipment"]
[null,"Falls Prevention","Guard rails"]
[null,null,"Window heights and cleaning"]
[null,null,"Anchorage points for building maintenance and cleaning"]
[null,null,"Access","Access to working spaces for construction, cleaning, maintenance and repairs"]
[null,null,"Scaffolding"]
{"$rows_left_out":62}