{"text_format":"1","workbook":"xlsx","n_sheets":10,"sheets":["Title Page","Instructions","Agenda & Attendance","Drawings","1","Minutes Template","AS1.1","Action Sheet Template","Parking Lot","Guidewords"],"not_rendered":{"charts":0,"images":2,"macros":1,"external_links":1,"defined_names":64,"comments":0,"pivot_tables":0},"unopened":[],"bounds":{"document_bytes":16777216,"sheet_cells":100000,"rows_first":2000,"rows_last":500,"rows_between":2000,"halvings":0,"cell_chars":16384,"cell_head_chars":4096},"cells_cut":0,"cells_raw":0,"read":"whole","date_system":"1900"}

{"sheet":"Title Page","index":0,"n_rows":34,"n_cols":10,"rows_kept":34,"cut":false,"hidden":false,"merged":[[3,3,7,7],[26,2,26,3],[26,4,26,8],[28,2,28,3],[28,4,28,8],[16,2,16,3],[16,4,16,8],[14,2,14,3],[18,2,18,3],[20,2,20,3],[24,2,24,3],[14,4,14,8],[18,4,18,8],[20,4,20,8],[24,4,24,8],[22,2,22,3],[43,2,43,4],[44,2,44,4],[53,2,53,4],[37,2,37,4],[38,2,38,4],[39,2,39,4],[40,2,40,4],[41,2,41,4],[42,2,42,4],[22,4,22,8],[54,2,54,4],[55,2,55,4],[32,6,32,9],[47,2,47,4],[48,2,48,4],[49,2,49,4],[50,2,50,4],[51,2,51,4],[52,2,52,4],[36,2,36,4],[33,2,33,4],[34,2,34,4],[35,2,35,4],[45,2,45,4],[46,2,46,4]]}
[]
[]
[]
[null,null,null,{"$f":"E17","v":"INSERT PROJECT TITLE"}]
[]
[]
[]
[]
[]
[null,null,null,null,null,"CHAZOP STUDY REPORT"]
[]
[]
[]
[]
[null,null,"Project Number",null,"INSERT PROJECT NUMBER"]
[]
[null,null,"Project Title",null,"INSERT PROJECT TITLE"]
[]
[null,null,"Client Name",null,"INSERT CLIENT NAME"]
[]
{"$rows_left_out":15}
{"sheet":"Instructions","index":1,"n_rows":58,"n_cols":5,"rows_kept":58,"cut":false,"hidden":false,"merged":[[16,2,16,5],[20,2,20,10],[26,2,26,10],[7,1,7,10],[10,1,10,10],[11,2,11,10],[12,2,12,10],[13,2,13,10],[15,1,15,10],[21,2,21,10],[22,2,22,10],[23,2,23,10],[24,2,24,10],[25,2,25,10],[1,3,2,8],[30,1,30,10],[31,2,31,10],[32,2,32,10],[33,2,33,10],[34,2,34,10],[35,2,35,10],[36,2,36,10],[38,1,38,10],[42,1,42,10],[44,2,44,3],[44,4,44,9],[45,2,45,3],[45,4,45,9],[46,2,46,3],[46,4,46,9],[47,2,47,3],[47,4,47,9],[48,2,48,3],[48,4,48,9],[50,1,50,10],[52,2,52,3],[52,4,52,9],[57,1,57,10],[53,2,53,3],[53,4,53,9],[54,2,54,3],[54,4,54,9],[55,2,55,3],[55,4,55,9]]}
[]
[null,null,null,"File Usage Instructions"]
[]
[]
["1.0","Introduction - Safety in Design Requirements"]
[]
[null,"Purpose:"]
[null,"The importance  of electrical, electronic and programmable electronic systems in safety related applications, is steadily growing. If the control system is sufficiently complex for the facility, it may be useful to consider this system in a separate HAZOP (sometimes referred as a CHAZOP; the ‘C’ prefix used to indicate computer based – both control and protective) or as a discrete component of a more general HAZOP. CHAZOP must be looked at as three distinctly different, but consecutively run stages, including, System, Loop and Sequence CHAZOP. Each stage involves a systematic and critical review using guidewords similar to those used in HAZOP. \n\nAll projects with control systems components must have a CHAZOP unless specified otherwise in the Project Documentation."]
[]
[null,"Timing:"]
[null,"Starting the CHAZOP. typically requires that the control system design meets the requirements set out in the control system functional specification and that (i) the HAZID is completed and (ii) a design review and process HAZOP has been completed and all outstanding items are actioned. \n"]
[null,null,"·     The System CHAZOP is undertaken prior to ordering the Automation / Control / Protection system equipment."]
[null,null,"·     The Loop CHAZOP is undertaken when a few critical instrument loops have been configured and certainly before all loops design are completed. This will identify the requirements for the entire system and set standards for further design."]
[null,null,"·     The Sequence CHAZOP is undertaken, similar to Loops, once a few sequences within a system have been documented in the functional specification. This will identify particular requirements of the system and set standards for further design."]
[]
[null,"Note: Unless stated otherwise, the Consultant/Contractor is required to comply with the requirements set out in Pr8187 - Safety in Design Procedure."]
[]
[1.1000000000000001,"Required Documentation"]
[]
[null,"The following list outlines the documentation typically required for CHAZOP workshops:"]
{"$rows_left_out":39}
{"sheet":"Agenda & Attendance","index":2,"n_rows":29,"n_cols":10,"rows_kept":29,"cut":false,"hidden":false,"merged":[[1,3,2,8],[44,7,44,8],[30,7,30,8],[43,7,43,8],[42,7,42,8],[41,7,41,8],[40,7,40,8],[39,7,39,8],[38,7,38,8],[37,7,37,8],[36,7,36,8],[35,7,35,8],[34,7,34,8],[33,7,33,8],[32,7,32,8],[31,7,31,8],[4,0,4,1],[44,3,44,4],[43,5,43,6],[44,5,44,6],[26,1,26,10],[29,5,29,6],[42,5,42,6],[28,3,28,4],[29,3,29,4],[42,3,42,4],[43,3,43,4],[39,3,39,4],[28,1,28,2],[29,1,29,2],[42,1,42,2],[43,1,43,2],[44,1,44,2],[30,1,30,2],[31,1,31,2],[32,1,32,2],[33,1,33,2],[34,1,34,2],[41,1,41,2],[39,1,39,2],[40,1,40,2],[36,1,36,2],[37,1,37,2],[38,1,38,2],[28,5,28,6],[38,5,38,6],[39,5,39,6],[40,3,40,4],[41,3,41,4],[30,5,30,6],[31,5,31,6],[32,5,32,6],[33,5,33,6],[34,5,34,6],[35,5,35,6],[36,5,36,6],[37,5,37,6],[40,5,40,6],[41,5,41,6],[35,3,35,4],[36,3,36,4],[37,3,37,4],[38,3,38,4],[4,2,4,10],[8,2,8,10],[7,2,7,10],[6,2,6,10],[5,2,5,10],[35,1,35,2],[30,3,30,4],[31,3,31,4],[32,3,32,4],[33,3,33,4],[34,3,34,4],[28,7,28,8],[29,7,29,8]]}
[]
[null,null,null,"AGENDA & ATTENDANCE"]
[]
[]
["Date",null,{"$f":"DATE","v":"INSERT CHAZOP DATE(S)"}]
["Head Contractor Name"]
["UW Project No. & Name",null,{"$f":"PROJNUM&\" \"&PROJTITLE","v":"INSERT PROJECT NUMBER INSERT PROJECT TITLE"}]
["Location (Site)"]
["Meeting Number"]
[]
[]
["2.0","Proposed Agenda"]
[]
[null,2.1,"Safety Share"]
[null,2.2000000000000002,"Introductions and Welcome (check of attendance in accordance with Pr8187 - Appendix B)"]
[null,2.2999999999999998,"Review previous actions from SID workships"]
[null,2.4,"Overview of systems associated with the control system design "]
[null,2.5,"Custom breakdown structure for workshop discussion - System"]
[null,null,"2.5.1","Application of system guidewords"]
[null,null,"2.5.2","Capture significant outcomes"]
{"$rows_left_out":10}
{"sheet":"Drawings","index":3,"n_rows":31,"n_cols":9,"rows_kept":31,"cut":false,"hidden":false,"merged":[[30,1,30,2],[27,1,27,2],[28,1,28,2],[29,1,29,2],[30,6,30,7],[29,6,29,7],[28,6,28,7],[27,6,27,7],[30,3,30,5],[29,3,29,5],[28,3,28,5],[27,3,27,5],[24,1,24,2],[25,1,25,2],[26,1,26,2],[26,6,26,7],[25,6,25,7],[24,6,24,7],[26,3,26,5],[25,3,25,5],[24,3,24,5],[21,1,21,2],[22,1,22,2],[23,1,23,2],[23,6,23,7],[22,6,22,7],[21,6,21,7],[23,3,23,5],[22,3,22,5],[21,3,21,5],[18,1,18,2],[19,1,19,2],[20,1,20,2],[20,6,20,7],[19,6,19,7],[18,6,18,7],[20,3,20,5],[19,3,19,5],[18,3,18,5],[16,1,16,2],[17,1,17,2],[15,8,15,9],[17,6,17,7],[16,6,16,7],[15,6,15,7],[17,3,17,5],[16,3,16,5],[1,3,2,7],[4,0,4,1],[4,2,4,10],[5,2,5,10],[6,2,6,10],[14,1,14,2],[15,1,15,2],[14,3,14,5],[15,3,15,5],[7,2,7,10],[12,1,12,10],[14,8,14,9],[14,6,14,7],[30,8,30,9],[29,8,29,9],[28,8,28,9],[27,8,27,9],[26,8,26,9],[25,8,25,9],[24,8,24,9],[23,8,23,9],[22,8,22,9],[21,8,21,9],[20,8,20,9],[19,8,19,9],[18,8,18,9],[17,8,17,9],[16,8,16,9]]}
[]
[null,null,null,"DRAWINGS"]
[]
[]
["Date",null,{"$f":"DATE","v":"INSERT CHAZOP DATE(S)"}]
["Head Contractor Name",null,{"$f":"IF(HEADCONTRACTOR=\"\",\"\",HEADCONTRACTOR)","v":""}]
["UW Project No. & Name",null,{"$f":"PROJNUM&\" \"&PROJTITLE","v":"INSERT PROJECT NUMBER INSERT PROJECT TITLE"}]
["Location (Site)",null,{"$f":"IF(LOCATION=\"\",\"\",LOCATION)","v":""}]
[]
[]
["4.0","List of Drawings"]
[]
[null,"The following table provides a list of drawings used during the workshop and their associated revision numbers. This table should be filled out prior to the workshop and be printed along with the guideword set. At the start of the workshop it should be distributed to each attendee for reference to the relevant P&IDs."]
[]
[null,"No.",null,"P&ID/Document Ref No.",null,null,"Revision No.",null,"Minutes Sheet Ref."]
[null,1]
[null,2]
[null,3]
[null,4]
[null,5]
{"$rows_left_out":12}
{"sheet":"1","index":4,"n_rows":27,"n_cols":9,"rows_kept":27,"cut":false,"hidden":false,"merged":[[4,3,4,4],[4,6,4,8]]}
["CHAZOP Minutes Recording Sheet"]
[]
[]
[]
["SYSTEM:",1,"DESCRIPTION:",null,null,"P&ID/Doc Ref No.:"]
[]
["Ref No.","Deviation-Guideword","Cause","Consequence(s)","Existing Safeguards","Action Description","Action By","Response or Action Sheet Reference No.","Date Closed"]
[1,"Maintenance"]
[{"$f":"A8+1","v":2}]
[{"$f":"A9+1","v":3}]
[4]
[5]
[6]
[7]
[8]
[9]
[10]
[11]
[12]
[13]
{"$rows_left_out":8}
{"sheet":"Minutes Template","index":5,"n_rows":27,"n_cols":9,"rows_kept":27,"cut":false,"hidden":false,"merged":[[4,3,4,4],[4,6,4,8]]}
["CHAZOP Minutes Recording Sheet"]
[]
[]
[]
["SYSTEM:",null,"DESCRIPTION:",null,null,"P&ID/Doc Ref No.:"]
[]
["Ref No.","Deviation-Guideword","Cause","Consequence(s)","Existing Safeguards","Action Description","Action By","Response or Action Sheet Reference No.","Date Closed"]
[1,"Standards"]
[{"$f":"A8+1","v":2}]
[{"$f":"A9+1","v":3}]
[4]
[5]
[6]
[7]
[8]
[9]
[10]
[11]
[12]
[13]
{"$rows_left_out":8}
{"sheet":"AS1.1","index":6,"n_rows":95,"n_cols":14,"rows_kept":95,"cut":false,"hidden":false,"merged":[[9,2,9,10],[1,3,4,7],[6,0,6,1],[6,2,6,10],[7,2,7,10],[8,2,8,10],[23,1,23,2],[23,3,23,10],[11,0,11,1],[11,2,11,10],[13,1,13,10],[15,3,15,4],[15,5,15,10],[17,3,17,4],[19,1,19,10],[21,1,21,2],[21,3,21,10],[22,1,22,2],[22,3,22,10],[35,1,35,2],[35,3,35,10],[24,1,24,2],[24,3,24,10],[25,1,25,2],[25,3,25,10],[27,1,27,10],[29,1,29,2],[29,3,29,10],[30,1,30,2],[30,3,30,10],[31,1,31,2],[31,3,31,10],[33,1,33,10],[42,0,42,1],[42,2,42,4],[42,5,42,7],[42,8,42,10],[36,1,36,2],[36,3,36,10],[37,1,37,2],[37,3,37,10],[38,1,38,2],[38,3,38,10],[40,1,40,10],[41,0,41,1],[41,2,41,4],[41,5,41,7],[41,8,41,10],[43,0,43,1],[43,2,43,4],[43,5,43,7],[43,8,43,10],[44,0,44,1],[44,2,44,4],[44,5,44,7],[44,8,44,10],[45,0,45,1],[45,2,45,4],[45,5,45,7],[45,8,45,10],[46,0,46,1],[46,2,46,4],[46,5,46,7],[46,8,46,10]]}
[null,null,null,null,null,null,null,null,null,null,null,null,"Node Numbers","Item Reference Numbers"]
[null,null,null,"CHAZOP ACTION & RESPONSE SHEET",null,null,null,null,null,null,null,null,1,1]
[null,null,null,null,null,null,null,null,null,null,null,null,{"$f":"M2+1","v":2},{"$f":"N2+1","v":2}]
[null,null,null,null,null,null,null,null,null,null,null,null,{"$f":"M3+1","v":3},3]
[null,null,null,null,null,null,null,null,null,null,null,null,4,4]
[null,null,null,null,null,null,null,null,null,null,null,null,5,5]
["CHAZOP Date(s)",null,{"$f":"DATE","v":"INSERT CHAZOP DATE(S)"},null,null,null,null,null,null,null,null,null,6,6]
["Head Contractor Name",null,{"$f":"IF(HEADCONTRACTOR=\"\",\"\",HEADCONTRACTOR)","v":""},null,null,null,null,null,null,null,null,null,7,7]
["UW Project No. & Name",null,{"$f":"PROJNUM&\" \"&PROJTITLE","v":"INSERT PROJECT NUMBER INSERT PROJECT TITLE"},null,null,null,null,null,null,null,null,null,8,8]
["Location (Site)",null,{"$f":"IF(LOCATION=\"\",\"\",LOCATION)","v":""},null,null,null,null,null,null,null,null,null,9,9]
[null,null,null,null,null,null,null,null,null,null,null,null,10,10]
["Action Sheet Due Date",null,null,null,null,null,null,null,null,null,null,null,11,11]
[null,null,null,null,null,null,null,null,null,null,null,null,12,12]
["P&ID Refs.",{"$f":"IF(VLOOKUP(NODE, INDIRECT(\"'\"&NODE&\"'!\"&\"NODE_DETAILS\"),6,0) = \"\",\"\", VLOOKUP(NODE,INDIRECT(\"'\"&NODE&\"'!\"&\"NODE_DETAILS\"),6,0))","v":""},null,null,null,null,null,null,null,null,null,null,{"$f":"M13+1","v":13},{"$f":"N13+1","v":13}]
[null,null,null,null,null,null,null,null,null,null,null,null,{"$f":"N14+1","v":14},{"$f":"N14+1","v":14}]
["SYSTEM:",1,null,"DESCRIPTION:",null,{"$f":"IF(VLOOKUP(NODE, INDIRECT(\"'\"&NODE&\"'!\"&\"NODE_DETAILS\"),3,0) = \"\",\"\", VLOOKUP(NODE,INDIRECT(\"'\"&NODE&\"'!\"&\"NODE_DETAILS\"),3,0))","v":""},null,null,null,null,null,null,15,15]
[null,null,null,null,null,null,null,null,null,null,null,null,16,16]
["Item Ref No.",1,null,"Sheet Ref No.",null,{"$f":"CONCATENATE(\"AS\",NODE,\".\",REF_NO)","v":"AS1.1"},null,null,null,null,null,null,17,17]
[null,null,null,null,null,null,null,null,null,null,null,null,18,18]
["1.0","Hazard Description",null,null,null,null,null,null,null,null,null,null,{"$f":"M19+1","v":19},19]
{"$rows_left_out":76}
{"sheet":"Action Sheet Template","index":7,"n_rows":95,"n_cols":14,"rows_kept":95,"cut":false,"hidden":false,"merged":[[24,1,24,2],[25,1,25,2],[6,0,6,1],[6,2,6,10],[7,2,7,10],[8,2,8,10],[9,2,9,10],[15,3,15,4],[15,5,15,10],[19,1,19,10],[22,1,22,2],[23,1,23,2],[17,3,17,4],[29,1,29,2],[30,1,30,2],[29,3,29,10],[30,3,30,10],[27,1,27,10],[1,3,4,7],[11,0,11,1],[11,2,11,10],[21,1,21,2],[21,3,21,10],[13,1,13,10],[38,1,38,2],[38,3,38,10],[42,0,42,1],[22,3,22,10],[23,3,23,10],[24,3,24,10],[25,3,25,10],[37,1,37,2],[37,3,37,10],[35,1,35,2],[36,1,36,2],[35,3,35,10],[36,3,36,10],[33,1,33,10],[31,1,31,2],[31,3,31,10],[43,0,43,1],[44,0,44,1],[45,0,45,1],[46,0,46,1],[40,1,40,10],[43,2,43,4],[44,2,44,4],[43,5,43,7],[43,8,43,10],[44,5,44,7],[41,5,41,7],[41,8,41,10],[41,0,41,1],[42,2,42,4],[42,5,42,7],[42,8,42,10],[46,2,46,4],[46,5,46,7],[46,8,46,10],[41,2,41,4],[44,8,44,10],[45,2,45,4],[45,5,45,7],[45,8,45,10]]}
[null,null,null,null,null,null,null,null,null,null,null,null,"Node Numbers","Item Reference Numbers"]
[null,null,null,"CHAZOP ACTION & RESPONSE SHEET",null,null,null,null,null,null,null,null,1,1]
[null,null,null,null,null,null,null,null,null,null,null,null,{"$f":"M2+1","v":2},{"$f":"N2+1","v":2}]
[null,null,null,null,null,null,null,null,null,null,null,null,{"$f":"M3+1","v":3},{"$f":"N3+1","v":3}]
[null,null,null,null,null,null,null,null,null,null,null,null,4,4]
[null,null,null,null,null,null,null,null,null,null,null,null,5,5]
["CHAZOP Date(s)",null,{"$f":"DATE","v":"INSERT CHAZOP DATE(S)"},null,null,null,null,null,null,null,null,null,6,6]
["Head Contractor Name",null,{"$f":"IF(HEADCONTRACTOR=\"\",\"\",HEADCONTRACTOR)","v":""},null,null,null,null,null,null,null,null,null,7,7]
["UW Project No. & Name",null,{"$f":"PROJNUM&\" \"&PROJTITLE","v":"INSERT PROJECT NUMBER INSERT PROJECT TITLE"},null,null,null,null,null,null,null,null,null,8,8]
["Location (Site)",null,{"$f":"IF(LOCATION=\"\",\"\",LOCATION)","v":""},null,null,null,null,null,null,null,null,null,9,9]
[null,null,null,null,null,null,null,null,null,null,null,null,10,10]
["Action Sheet Due Date",null,null,null,null,null,null,null,null,null,null,null,11,11]
[null,null,null,null,null,null,null,null,null,null,null,null,12,12]
["P&ID Refs.",{"$f":"IF(VLOOKUP(NODE, INDIRECT(\"'\"&NODE&\"'!\"&\"NODE_DETAILS\"),6,0) = \"\",\"\", VLOOKUP(NODE,INDIRECT(\"'\"&NODE&\"'!\"&\"NODE_DETAILS\"),6,0))","v":{"$error":"#REF!"}},null,null,null,null,null,null,null,null,null,null,{"$f":"M13+1","v":13},{"$f":"N13+1","v":13}]
[null,null,null,null,null,null,null,null,null,null,null,null,{"$f":"N14+1","v":14},{"$f":"N14+1","v":14}]
["SYSTEM:",null,null,"DESCRIPTION:",null,{"$f":"IF(VLOOKUP(NODE, INDIRECT(\"'\"&NODE&\"'!\"&\"NODE_DETAILS\"),3,0) = \"\",\"\", VLOOKUP(NODE,INDIRECT(\"'\"&NODE&\"'!\"&\"NODE_DETAILS\"),3,0))","v":{"$error":"#REF!"}},null,null,null,null,null,null,15,15]
[null,null,null,null,null,null,null,null,null,null,null,null,16,16]
["Item Ref No.",null,null,"Sheet Ref No.",null,{"$f":"CONCATENATE(\"AS\",NODE,\".\",REF_NO)","v":"AS."},null,null,null,null,null,null,17,17]
[null,null,null,null,null,null,null,null,null,null,null,null,18,18]
["1.0","Hazard Description",null,null,null,null,null,null,null,null,null,null,19,19]
{"$rows_left_out":76}
{"sheet":"Parking Lot","index":8,"n_rows":31,"n_cols":11,"rows_kept":31,"cut":false,"hidden":false,"merged":[[26,10,26,11],[15,10,15,11],[16,10,16,11],[17,10,17,11],[18,10,18,11],[19,10,19,11],[27,10,27,11],[28,10,28,11],[29,10,29,11],[30,10,30,11],[12,1,12,11],[20,10,20,11],[21,10,21,11],[22,10,22,11],[23,10,23,11],[24,10,24,11],[25,10,25,11],[30,1,30,2],[30,3,30,5],[30,6,30,7],[30,8,30,9],[14,10,14,11],[28,1,28,2],[28,3,28,5],[28,6,28,7],[28,8,28,9],[29,1,29,2],[29,3,29,5],[29,6,29,7],[29,8,29,9],[27,1,27,2],[27,3,27,5],[27,6,27,7],[27,8,27,9],[24,1,24,2],[24,3,24,5],[24,6,24,7],[24,8,24,9],[25,1,25,2],[25,3,25,5],[25,6,25,7],[25,8,25,9],[26,1,26,2],[26,3,26,5],[26,6,26,7],[26,8,26,9],[22,6,22,7],[22,8,22,9],[23,1,23,2],[23,3,23,5],[23,6,23,7],[23,8,23,9],[22,1,22,2],[22,3,22,5],[20,1,20,2],[20,3,20,5],[20,6,20,7],[20,8,20,9],[21,1,21,2],[21,3,21,5],[21,6,21,7],[21,8,21,9],[18,1,18,2],[18,3,18,5],[18,6,18,7],[18,8,18,9],[19,1,19,2],[19,3,19,5],[19,6,19,7],[19,8,19,9],[16,1,16,2],[16,3,16,5],[16,6,16,7],[16,8,16,9],[17,1,17,2],[17,3,17,5],[17,6,17,7],[17,8,17,9],[14,8,14,9],[15,1,15,2],[15,3,15,5],[15,6,15,7],[15,8,15,9],[1,3,2,7],[4,0,4,1],[14,1,14,2],[14,3,14,5],[14,6,14,7],[4,2,4,11],[5,2,5,11],[6,2,6,11],[7,2,7,11]]}
[]
[null,null,null,"PARKING LOT"]
[]
[]
["Date",null,{"$f":"DATE","v":"INSERT CHAZOP DATE(S)"}]
["Head Contractor Name",null,{"$f":"IF(HEADCONTRACTOR=\"\",\"\",HEADCONTRACTOR)","v":""}]
["UW Project No. & Name",null,{"$f":"PROJNUM&\" \"&PROJTITLE","v":"INSERT PROJECT NUMBER INSERT PROJECT TITLE"}]
["Location (Site)",null,{"$f":"IF(LOCATION=\"\",\"\",LOCATION)","v":""}]
[]
[]
["5.0","Parking Lot Issues"]
[]
[null,"The following table provides a list of drawings used during the workshop and their associated revision numbers. This table should be filled out prior to the workshop and be printed along with the guideword set. At the start of the workshop it should be distributed to each attendee for reference to the relevant P&IDs."]
[]
[null,"No.",null,"Issue",null,null,"Document Ref",null,"Referred to",null,"Minutes Sheet Ref."]
[null,1]
[null,2]
[null,3]
[null,4]
[null,5]
{"$rows_left_out":12}
{"sheet":"Guidewords","index":9,"n_rows":38,"n_cols":3,"rows_kept":38,"cut":false,"hidden":false,"merged":[[25,0,37,0],[1,1,4,2],[7,0,24,0],[6,2,6,5],[7,2,7,5],[8,2,8,5],[14,2,14,5],[15,2,15,5],[16,2,16,5],[17,2,17,5],[18,2,18,5],[19,2,19,5],[20,2,20,5],[21,2,21,5],[22,2,22,5],[23,2,23,5],[9,2,9,5],[10,2,10,5],[11,2,11,5],[12,2,12,5],[13,2,13,5],[24,2,24,5],[25,2,25,5],[26,2,26,5],[27,2,27,5],[28,2,28,5],[34,2,34,5],[35,2,35,5],[36,2,36,5],[37,2,37,5],[29,2,29,5],[30,2,30,5],[31,2,31,5],[32,2,32,5],[33,2,33,5]]}
[]
[null,"CHAZOP SYSTEM GUIDEWORDS"]
[]
[]
[]
[]
["Category","Guidewords","Description"]
["Overview","Introduction","Usage - Integrity - Availability - Vulnerability - Control/protection - Maintainability"]
[null,"Standards","Equipment standards - Compatibility of equipment from different suppliers - Quality of installation, maintenance and housekeeping"]
[null,"System Communication","Speed, capacity, bandwidth, loading - Protocols/interfaces - Delays, Relative timing - Error detection/correction"]
[null,"Maintenance","Who maintains/operates - Permits to work - Training - Isolation procedures - Modification control - Start up/shutdown - Individual hardware units - Fault diagnosis - Status indication - Online requirement - Accessibility - Test facilities - Power supply checks - Spares (hot spare?) - Documentation - Equipment labelling (cabinets, cables, ect.) - Preventative maintenance"]
[null,"Earthing/isolation","Earthing (signal, static, power) - ELV/LV/HV separation - Surge protection (lighting) - Area classificatio/IS separation "]
[null,"Power Distribution","Voltage - Capacity/spare capacity - Discrimination - Inrush - Fault capacity - UPS?DC battery backup"]
[null,"Operability","Sufficient operator stations (start-up, emergency, engineer access) - Printers - Security - Effect of failures - Lighting (control & other rooms, emergency) - Layout/ergonomics - Communications (phonse, radio, intercoms, interference)"]
[null,"Trending","Historical - Archiving and retrieving - Independent for critical measurements"]
[null,"Alarms","Dedicated panel - Audible (control room, field, other) - Testing (methods, frequency, records) - Maintenance"]
[null,"Protective System","Have all required safety systems been identified (sensors, trip system, final elements e.g. pump starting)"]
[null,"Reliability","Required value - Achieved by inherently reliable design - Achieved by planned maintenance - Achieved by proof testing (methods, frequency, records)"]
[null,"Unplanned Maintenance","Overrides (records)"]
[null,"Performance","Loading - Spare capacity - Upgrade path - Disaster recovery"]
{"$rows_left_out":18}